{"text_format":"1","workbook":"xlsx","n_sheets":5,"sheets":["Header","1","instance","data","parameters"],"not_rendered":{"charts":0,"images":0,"macros":1,"external_links":0,"defined_names":1,"comments":0,"pivot_tables":0},"unopened":[],"bounds":{"document_bytes":16777216,"sheet_cells":100000,"rows_first":2000,"rows_last":500,"rows_between":2000,"halvings":0,"cell_chars":16384,"cell_head_chars":4096},"cells_cut":0,"cells_raw":0,"read":"whole","date_system":"1900"}

{"sheet":"Header","index":0,"n_rows":49,"n_cols":5,"rows_kept":49,"cut":false,"hidden":false,"merged":[]}
[]
[]
[]
[]
[]
[]
[null,"Reporting Framework","XBRL-Taxonomien gemäß ITS on reporting der EBA ab März 2014, Bundesbank"]
[null,"Official website:","http://www.bundesbank.de/Redaktion/DE/Standardartikel/Service/Meldewesen/xbrl_taxonomie_gemaess_its_on_reportig_der_eba_2014.html "]
[null,"RECEX Author:","Javi Mora, XBRL Spain ","javier.mora@xbrl.org.es","April, 2014"]
[null,"RECEX website","http://www.openfiling.info/recex/","Licenses: EUPL, CreativeCommons  BY"]
[]
[null,null,"General information for the reporting","General information for the reporting","References"]
[null,null,null,"010"]
[null,"SI010","Identification code of the sender","13069940"]
[null,"SI020","Identification code type of the sender","creditorNumber"]
[null,"SI030","Identification code of the reporting entity","13069940"]
[null,"SI040","Identification code type of the reporting entity","creditorNumber"]
[null,null,"Identification code of the receiver"]
[null,null,"Identification code type of the receiver"]
[null,"DI070","Date created"]
[null,"DI170","Reporting period start date"]
[null,"DI120","Reporting period end date","2014-09-30"]
[null,null,"Solo / consolidated"]
[null,"SI080","Test flag","test"]
[null,null,"Name of the reporting software"]
[null,"SI090","Contact name","Herr Max Mustermann"]
[null,"SI100","Contact phone number","+4969000000"]
[null,"SI110","Contact email address","mustermann@muster-bank.de"]
[null,"SI120","Contact internal user id"]
[]
[]
[null,null,"C_00.01","Nature of Report ","References"]
[null,null,null,"010"]
[null,"N010","Memorandum items Accounting framework","eba_AS:x1","AS:x1 National GAAP / AS:x2 IFRS"]
[null,"N020","Reporting Level","eba_SC:x6","SC:x6 Individual / SC:x7 Consolidated"]
[]
[]
[null,null,"Filing Indicators","Nature of Filing","References"]
[null,null,null,"010"]
[null,"F010","Filing Indicator","C_00.01"]
{"$rows_left_out":10}
{"sheet":"1","index":1,"n_rows":103,"n_cols":5,"rows_kept":103,"cut":false,"hidden":false,"merged":[[1,1,1,4]]}
[]
[null,"C 01.00 - EIGENMITTEL (CA1)"]
[]
[null,"Zeilen","ID","Posten","Betrag"]
[null,"010",1,"EIGENMITTEL",50]
[null,"015","1.1","Kernkapital",50]
[null,"020",{"$f":"C$6&\".1\"","v":"1.1.1"},"HARTES KERNKAPITAL",50]
[null,"030",{"$f":"C$7&\".1\"","v":"1.1.1.1"},"Als hartes Kernkapital anrechenbare Kapitalinstrumente",50]
[null,"040",{"$f":"C$8&\".1\"","v":"1.1.1.1.1"},"Eingezahlte Kapitalinstrumente ",50]
[null,"050","1.1.1.1.2*","Nachrichtliche Position: Nicht anrechenbare Kapitalinstrumente"]
[null,"060",{"$f":"C$8&\".3\"","v":"1.1.1.1.3"},"Agio"]
[null,"070",{"$f":"C$8&\".4\"","v":"1.1.1.1.4"},"(-) Eigene Instrumente des harten Kernkapitals"]
[null,"080",{"$f":"C$12&\".1\"","v":"1.1.1.1.4.1"},"(-) Direkte Positionen in Instrumenten des harten Kernkapitals"]
[null,"090",{"$f":"C$12&\".2\"","v":"1.1.1.1.4.2"},"(-) Indirekte Positionen in Instrumenten des harten Kernkapitals"]
[null,"091",{"$f":"C$12&\".3\"","v":"1.1.1.1.4.3"},"(-) Synthetische Positionen in Instrumenten des harten Kernkapitals"]
[null,"092",{"$f":"C$8&\".5\"","v":"1.1.1.1.5"},"(-) Bestehende oder eventuelle Verpflichtungen zum Kauf eigener Instrumente harten Kernkapitals"]
[null,"130",{"$f":"C$7&\".2\"","v":"1.1.1.2"},"Einbehaltene Gewinne",0]
[null,"140",{"$f":"C$17&\".1\"","v":"1.1.1.2.1"},"Einbehaltene Gewinne der Vorjahre",0]
[null,"150",{"$f":"C$17&\".2\"","v":"1.1.1.2.2"},"Anrechenbarer Gewinn oder Verlust"]
[null,"160",{"$f":"C$19&\".1\"","v":"1.1.1.2.2.1"},"Den Eigentümern der Muttergesellschaft zurechenbarer Gewinn oder Verlust"]
[null,"170",{"$f":"C$19&\".2\"","v":"1.1.1.2.2.2"},"(-) Teil des nicht anrechenbaren Zwischengewinns oder Gewinns zum Jahresende"]
[null,"180",{"$f":"C$7&\".3\"","v":"1.1.1.3"},"Kumuliertes sonstiges Ergebnis"]
[null,"200",{"$f":"C$7&\".4\"","v":"1.1.1.4"},"Sonstige Rücklagen",0]
[null,"210",{"$f":"C$7&\".5\"","v":"1.1.1.5"},"Fonds für allgemeine Bankrisiken"]
[null,"220",{"$f":"C$7&\".6\"","v":"1.1.1.6"},"Übergangsanpassungen aufgrund von bestandsgeschützten Kapitalinstrumenten des harten Kernkapitals"]
[null,"230",{"$f":"C$7&\".7\"","v":"1.1.1.7"},"Zum harten Kernkapital zählende Minderheitsbeteiligungen"]
[null,"240",{"$f":"C$7&\".8\"","v":"1.1.1.8"},"Übergangsanpassungen aufgrund zusätzlicher Minderheitsbeteiligungen"]
[null,"250",{"$f":"C$7&\".9\"","v":"1.1.1.9"},"Aufgrund von Abzugs- und Korrekturposten vorzunehmende Anpassungen am harten Kernkapital"]
[null,"260",{"$f":"C$28&\".1\"","v":"1.1.1.9.1"},"(-) Anstieg des Eigenkapitals, der sich aus verbrieften Aktiva ergibt"]
[null,"270",{"$f":"C$28&\".2\"","v":"1.1.1.9.2"},"Rücklagen für Sicherungsgeschäfte für Zahlungsströme"]
[null,"280",{"$f":"C$28&\".3\"","v":"1.1.1.9.3"},"Durch Veränderungen der eigenen Bonität bedingte Gewinne oder Verluste aus zum beizulegenden Zeitwert bewerteten eigenen Verbindlichkeiten"]
[null,"285",{"$f":"C$28&\".4\"","v":"1.1.1.9.4"},"Gewinne und Verluste aus zum Zeitwert bilanzierten derivativen Verbindlichkeiten, die aus dem eigenen Kreditrisiko des Instituts resultieren"]
[null,"290",{"$f":"C$28&\".5\"","v":"1.1.1.9.5"},"(-) Wertanpassungen aufgrund der Anforderungen für eine vorsichtige Bewertung"]
[null,"300",{"$f":"C$7&\".10\"","v":"1.1.1.10"},"(-) Geschäfts- oder Firmenwert"]
[null,"310",{"$f":"C$34&\".1\"","v":"1.1.1.10.1"},"(-) Als immaterieller Vermögenswert bilanzierter Geschäfts- oder Firmenwert"]
[null,"320",{"$f":"C$34&\".2\"","v":"1.1.1.10.2"},"(-) In den Wertansätzen der wesentlichen Beteiligungen enthaltener Geschäfts- oder Firmenwert"]
[null,"330",{"$f":"C$34&\".3\"","v":"1.1.1.10.3"},"Mit dem Geschäfts- oder Firmenwert verbundene latente Steuerschulden"]
[null,"340",{"$f":"C$7&\".11\"","v":"1.1.1.11"},"(-) Sonstige immaterielle Vermögenswerte",0]
[null,"350",{"$f":"C$38&\".1\"","v":"1.1.1.11.1"},"(-) Bruttobetrag der sonstigen immateriellen Vermögenswerte",0]
[null,"360",{"$f":"C$38&\".2\"","v":"1.1.1.11.2"},"Mit den sonstigen immateriellen Vermögenswerten verbundene latente Steuerschulden"]
{"$rows_left_out":64}
{"sheet":"instance","index":2,"n_rows":32,"n_cols":24,"rows_kept":32,"cut":false,"hidden":true,"merged":[]}
["","","","","","",null,"","","","","","","","","","","","","","","","",""]
["","","","","","",null,"","","","","","","","","","","","","","","","",""]
["","","","","","PLEASE WAIT UNTIL END!!!",null,"","","","","","","","","","","","","","","","",""]
["","","","","","",null,"","","","","","","","","","","","","","","","",""]
["","","","","","",null,"","","","","","","","","","","","","","","","",""]
["RowID","Footnote","Primary Item","Decimals","UnitRef","Fact","Identifier","IdentifierSchema","PeriodInitDuration","PeriodEndInstant","Dimension","DimensionMember","Dimension","DimensionMember","Dimension","DimensionMember","Dimension","DimensionMember","Dimension","DimensionMember","Dimension","DimensionMember","Dimension","DimensionMember"]
["","","de_ext_met:si1","","","01306994",1306994,"http://www.bundesbank.de/ext/basis/identifiertyp/creditorNumber","","2014-09-30","","","","","","","","","","","","","",""]
["","","de_ext_met:si2","","","creditorNumber",1306994,"http://www.bundesbank.de/ext/basis/identifiertyp/creditorNumber","","2014-09-30","","","","","","","","","","","","","",""]
["","","de_ext_met:si3","","","01306994",1306994,"http://www.bundesbank.de/ext/basis/identifiertyp/creditorNumber","","2014-09-30","","","","","","","","","","","","","",""]
["","","de_ext_met:si4","","","creditorNumber","01306994","http://www.bundesbank.de/ext/basis/identifiertyp/creditorNumber","","2014-09-30","","","","","","","","","","","","","",""]
["","","de_ext_met:di12","","","2014-09-30","01306994","http://www.bundesbank.de/ext/basis/identifiertyp/creditorNumber","","2014-09-30","","","","","","","","","","","","","",""]
["","","de_ext_met:si8","","","test","01306994","http://www.bundesbank.de/ext/basis/identifiertyp/creditorNumber","","2014-09-30","","","","","","","","","","","","","",""]
["","","de_ext_met:si9","","","Herr Max Mustermann","01306994","http://www.bundesbank.de/ext/basis/identifiertyp/creditorNumber","","2014-09-30","","","","","","","","","","","","","",""]
["","","de_ext_met:si10","","","+4969000000","01306994","http://www.bundesbank.de/ext/basis/identifiertyp/creditorNumber","","2014-09-30","","","","","","","","","","","","","",""]
["","","de_ext_met:si11","","","mustermann@muster-bank.de","01306994","http://www.bundesbank.de/ext/basis/identifiertyp/creditorNumber","","2014-09-30","","","","","","","","","","","","","",""]
["","","eba:ei4","","","eba_AS:x1","01306994","http://www.bundesbank.de/ext/basis/identifiertyp/creditorNumber","","2014-09-30","eba_dim:BAS","eba_BA:x17","","","","","","","","","","","",""]
["","","eba:ei207","","","eba_SC:x6","01306994","http://www.bundesbank.de/ext/basis/identifiertyp/creditorNumber","","2014-09-30","eba_dim:BAS","eba_BA:x17","","","","","","","","","","","",""]
["","","find:filingIndicator","","","C_00.01","01306994","http://www.bundesbank.de/ext/basis/identifiertyp/creditorNumber","","2014-09-30","/**Tuple","find:fIndicators","/**Unbounded","","","","","","","","","","",""]
["","","find:filingIndicator","","","C_01.00","01306994","http://www.bundesbank.de/ext/basis/identifiertyp/creditorNumber","","2014-09-30","/**Tuple","find:fIndicators","/**Unbounded","","","","","","","","","","",""]
["","","eba:mi81","0","U-EUR","50","01306994","http://www.bundesbank.de/ext/basis/identifiertyp/creditorNumber","","2014-09-30","eba_dim:BAS","eba_BA:x11","eba_dim:MCY","eba_MC:x275","eba_dim:OFS","eba_OF:x10","","","","","","","",""]
["","","eba:mi81","0","U-EUR","50","01306994","http://www.bundesbank.de/ext/basis/identifiertyp/creditorNumber","","2014-09-30","eba_dim:BAS","eba_BA:x11","eba_dim:MCY","eba_MC:x275","eba_dim:OFS","eba_OF:x8","","","","","","","",""]
["","","eba:mi81","0","U-EUR","50","01306994","http://www.bundesbank.de/ext/basis/identifiertyp/creditorNumber","","2014-09-30","eba_dim:BAS","eba_BA:x11","eba_dim:MCY","eba_MC:x275","eba_dim:OFS","eba_OF:x2","","","","","","","",""]
["","","eba:mi76","0","U-EUR","50","01306994","http://www.bundesbank.de/ext/basis/identifiertyp/creditorNumber","","2014-09-30","eba_dim:BAS","eba_BA:x11","eba_dim:CNO","eba_BT:x4","eba_dim:MCY","eba_MC:x133","eba_dim:OFS","eba_OF:x2","","","","","",""]
["","","eba:mi53","0","U-EUR","50","01306994","http://www.bundesbank.de/ext/basis/identifiertyp/creditorNumber","","2014-09-30","eba_dim:BAS","eba_BA:x11","eba_dim:CNO","eba_BT:x4","eba_dim:MCY","eba_MC:x134","eba_dim:OFS","eba_OF:x2","","","","","",""]
["","","eba:mi76","0","U-EUR","0","01306994","http://www.bundesbank.de/ext/basis/identifiertyp/creditorNumber","","2014-09-30","eba_dim:BAS","eba_BA:x11","eba_dim:CNO","eba_BT:x4","eba_dim:MCY","eba_MC:x363","eba_dim:OFS","eba_OF:x2","","","","","",""]
["","","eba:mi53","0","U-EUR","0","01306994","http://www.bundesbank.de/ext/basis/identifiertyp/creditorNumber","","2014-09-30","eba_dim:BAS","eba_BA:x11","eba_dim:CNO","eba_BT:x4","eba_dim:MCY","eba_MC:x301","eba_dim:OFS","eba_OF:x2","","","","","",""]
["","","eba:mi53","0","U-EUR","0","01306994","http://www.bundesbank.de/ext/basis/identifiertyp/creditorNumber","","2014-09-30","eba_dim:BAS","eba_BA:x11","eba_dim:CNO","eba_BT:x4","eba_dim:MCY","eba_MC:x269","eba_dim:OFS","eba_OF:x2","","","","","",""]
["","","eba:mi76","0","U-EUR","0","01306994","http://www.bundesbank.de/ext/basis/identifiertyp/creditorNumber","","2014-09-30","eba_dim:BAS","eba_BA:x11","eba_dim:MCY","eba_MC:x211","eba_dim:OFS","eba_OF:x2","","","","","","","",""]
["","","eba:mi53","0","U-EUR","0","01306994","http://www.bundesbank.de/ext/basis/identifiertyp/creditorNumber","","2014-09-30","eba_dim:BAS","eba_BA:x11","eba_dim:MCY","eba_MC:x210","eba_dim:OFS","eba_OF:x2","","","","","","","",""]
["","","","","","","","","","","","","","","","","","","","","","","",""]
["","","","","","","","","","","","","","","","","","","","","","","",""]
["","","","","","","","","","","","","","","","","","","","","","","",""]

{"sheet":"data","index":3,"n_rows":144,"n_cols":24,"rows_kept":144,"cut":false,"hidden":true,"merged":[]}
[]
[]
[]
[]
[]
["RowID","Footnote","Primary Item","Decimals","UnitRef","Fact","Identifier","IdentifierSchema","PeriodInitDuration","PeriodEndInstant","Dimension","DimensionMember","Dimension","DimensionMember","Dimension","DimensionMember","Dimension","DimensionMember","Dimension","DimensionMember","Dimension","DimensionMember","Dimension","DimensionMember"]
["/*"]
["/* "]
["/*"]
[{"$f":"IF(F10=\"\",\"/*\",\"\")","v":""},null,"SI010",null,null,{"$f":"IF(Header!D14=\"\",\"\",Header!D14)","v":"13069940"}]
["",null,"SI020",null,null,{"$f":"IF(Header!D15=\"\",\"\",Header!D15)","v":"creditorNumber"}]
["",null,"SI030",null,null,{"$f":"IF(Header!D16=\"\",\"\",Header!D16)","v":"13069940"}]
["",null,"SI040",null,null,{"$f":"IF(Header!D17=\"\",\"\",Header!D17)","v":"creditorNumber"}]
["/*",null,null,null,null,{"$f":"IF(Header!D18=\"\",\"\",Header!D18)","v":""}]
["/*",null,null,null,null,{"$f":"IF(Header!D19=\"\",\"\",Header!D19)","v":""}]
["/*",null,"DI070",null,null,{"$f":"IF(Header!D20=\"\",\"\",Header!D20)","v":""}]
["/*",null,"DI170",null,null,{"$f":"IF(Header!D21=\"\",\"\",Header!D21)","v":""}]
["",null,"DI120",null,null,{"$f":"IF(Header!D22=\"\",\"\",Header!D22)","v":"2014-09-30"}]
["/*",null,null,null,null,{"$f":"IF(Header!D23=\"\",\"\",Header!D23)","v":""}]
["",null,"SI080",null,null,{"$f":"IF(Header!D24=\"\",\"\",Header!D24)","v":"test"}]
["/*",null,null,null,null,{"$f":"IF(Header!D25=\"\",\"\",Header!D25)","v":""}]
["",null,"SI090",null,null,{"$f":"IF(Header!D26=\"\",\"\",Header!D26)","v":"Herr Max Mustermann"}]
["",null,"SI100",null,null,{"$f":"IF(Header!D27=\"\",\"\",Header!D27)","v":"+4969000000"}]
["",null,"SI110",null,null,{"$f":"IF(Header!D28=\"\",\"\",Header!D28)","v":"mustermann@muster-bank.de"}]
["/*",null,"SI120",null,null,{"$f":"IF(Header!D29=\"\",\"\",Header!D29)","v":""}]
["/*",null,null,null,null,{"$f":"IF(Header!D30=\"\",\"\",Header!D30)","v":""}]
["/*",null,null,null,null,{"$f":"IF(Header!D31=\"\",\"\",Header!D31)","v":""}]
["/*"]
["/*"]
["",null,"N010",null,null,{"$f":"IF(Header!D34=\"\",\"\",Header!D34)","v":"eba_AS:x1"}]
["",null,"N020",null,null,{"$f":"IF(Header!D35=\"\",\"\",Header!D35)","v":"eba_SC:x6"}]
["/*",null,null,null,null,{"$f":"IF(Header!D36=\"\",\"\",Header!D36)","v":""}]
["/*",null,null,null,null,{"$f":"IF(Header!D37=\"\",\"\",Header!D37)","v":""}]
["/*"]
["/*"]
["",null,"F010",null,null,{"$f":"IF(Header!D40=\"\",\"\",Header!D40)","v":"C_00.01"}]
["",null,"F020",null,null,{"$f":"IF(Header!D41=\"\",\"\",Header!D41)","v":"C_01.00"}]
["/*",null,"F030",null,null,{"$f":"IF(Header!D42=\"\",\"\",Header!D42)","v":""}]
["/*",null,"F040",null,null,{"$f":"IF(Header!D43=\"\",\"\",Header!D43)","v":""}]
["/*",null,"F050",null,null,{"$f":"IF(Header!D44=\"\",\"\",Header!D44)","v":""}]
{"$rows_left_out":105}
{"sheet":"parameters","index":4,"n_rows":147,"n_cols":24,"rows_kept":147,"cut":false,"hidden":true,"merged":[]}
["RowID","Footnote","Primary Item","Decimals","UnitRef","Fact","Identifier","IdentifierSchema","PeriodInitDuration","PeriodEndInstant","Dimension","DimensionMember","Dimension","DimensionMember","Dimension","DimensionMember","Dimension","DimensionMember","Dimension","DimensionMember","Dimension","DimensionMember","Dimension","DimensionMember"]
["/* "]
["/* "]
["/* "]
["/* "]
["/**OutputHeader","<?xml version=\"1.0\" encoding=\"utf-8\"?>\n<xbrli:xbrl\n  xmlns:de_ext_dim=\"http://www.bundesbank.de/xbrl/dict/dim\"\n  xmlns:de_ext_met=\"http://www.bundesbank.de/xbrl/dict/met\"\n  xmlns:de_ext_typ=\"http://www.bundesbank.de/xbrl/dict/typ\"\n  xmlns:eba=\"http://www.eba.europa.eu/xbrl/crr/dict/met\"\n  xmlns:eba_AP=\"http://www.eba.europa.eu/xbrl/crr/dict/dom/AP\"\n  xmlns:eba_AS=\"http://www.eba.europa.eu/xbrl/crr/dict/dom/AS\"\n  xmlns:eba_BA=\"http://www.eba.europa.eu/xbrl/crr/dict/dom/BA\"\n  xmlns:eba_BT=\"http://www.eba.europa.eu/xbrl/crr/dict/dom/BT\"\n  xmlns:eba_CP=\"http://www.eba.europa.eu/xbrl/crr/dict/dom/CP\"\n  xmlns:eba_CT=\"http://www.eba.europa.eu/xbrl/crr/dict/dom/CT\"\n  xmlns:eba_EC=\"http://www.eba.europa.eu/xbrl/crr/dict/dom/EC\"\n  xmlns:eba_IM=\"http://www.eba.europa.eu/xbrl/crr/dict/dom/IM\"\n  xmlns:eba_MC=\"http://www.eba.europa.eu/xbrl/crr/dict/dom/MC\"\n  xmlns:eba_NC=\"http://www.eba.europa.eu/xbrl/crr/dict/dom/NC\"\n  xmlns:eba_OF=\"http://www.eba.europa.eu/xbrl/crr/dict/dom/OF\"\n  xmlns:eba_PL=\"http://www.eba.europa.eu/xbrl/crr/dict/dom/PL\"\n  xmlns:eba_SC=\"http://www.eba.europa.eu/xbrl/crr/dict/dom/SC\"\n  xmlns:eba_TA=\"http://www.eba.europa.eu/xbrl/crr/dict/dom/TA\"\n  xmlns:eba_TI=\"http://www.eba.europa.eu/xbrl/crr/dict/dom/TI\"\n  xmlns:eba_TR=\"http://www.eba.europa.eu/xbrl/crr/dict/dom/TR\"\n  xmlns:eba_ZZ=\"http://www.eba.europa.eu/xbrl/crr/dict/dom/ZZ\"\n  xmlns:eba_dim=\"http://www.eba.europa.eu/xbrl/crr/dict/dim\"\n  xmlns:eba_typ=\"http://www.eba.europa.eu/xbrl/crr/dict/typ\"\n  xmlns:find=\"http://www.eurofiling.info/xbrl/ext/filing-indicators\"\n  xmlns:iso4217=\"http://www.xbrl.org/2003/iso4217\"\n  xmlns:link=\"http://www.xbrl.org/2003/linkbase\"\n  xmlns:xbrldi=\"http://xbrl.org/2006/xbrldi\"\n  xmlns:xbrli=\"http://www.xbrl.org/2003/instance\"\n  xmlns:xlink=\"http://www.w3.org/1999/xlink\"\n  xmlns:xsi=\"http://www.w3.org/2001/XMLSchema-instance\">\n    <link:schemaRef\n      xlink:href=\"http://www.eba.europa.eu/eu/fr/xbrl/crr/fws/corep/its-2013-02/2014-03-31/mod/corep_ind_bbk.xsd\"\n      xlink:type=\"simple\"/>"]
["/**OutputMiddle","    <xbrli:unit id=\"U-EUR\">\n        <xbrli:measure>iso4217:EUR</xbrli:measure>\n    </xbrli:unit>"]
["/**OutputTail","</xbrli:xbrl>"]
["/* "]
["/**Replace","Entity",null,null,null,null,{"$f":"Header!D16","v":"13069940"},"http://www.bundesbank.de/ext/basis/identifiertyp/creditorNumber",null,"2014-09-30"]
["/* "]
["/* "]
["/**Replace","SI010","de_ext_met:si1",null,null,null,"Entity"]
["/**Replace","SI020","de_ext_met:si2",null,null,null,"Entity"]
["/**Replace","SI030","de_ext_met:si3",null,null,null,"Entity"]
["/**Replace","SI040","de_ext_met:si4",null,null,null,"Entity"]
["/**Replace"]
["/**Replace"]
["/**Replace","DI070","de_ext_met:di7",null,null,null,"Entity"]
["/**Replace","DI170","de_ext_met:di17",null,null,null,"Entity"]
["/**Replace","DI120","de_ext_met:di12",null,null,null,"Entity"]
["/**Replace"]
["/**Replace","SI080","de_ext_met:si8",null,null,null,"Entity"]
["/**Replace"]
["/**Replace","SI090","de_ext_met:si9",null,null,null,"Entity"]
["/**Replace","SI100","de_ext_met:si10",null,null,null,"Entity"]
["/**Replace","SI110","de_ext_met:si11",null,null,null,"Entity"]
["/**Replace","SI120","de_ext_met:si12",null,null,null,"Entity"]
["/**Replace"]
["/**Replace"]
["/**Replace"]
["/**Replace"]
["/**Replace","N010","eba:ei4",null,null,null,"Entity",null,null,null,"eba_dim:BAS","eba_BA:x17"]
["/**Replace","N020","eba:ei207",null,null,null,"Entity",null,null,null,"eba_dim:BAS","eba_BA:x17"]
["/**Replace"]
["/**Replace"]
["/**Replace"]
["/**Replace"]
["/**Replace","F010","find:filingIndicator",null,null,null,"Entity",null,null,null,"/**Tuple","find:fIndicators","/**Unbounded"]
["/**Replace","F020","find:filingIndicator",null,null,null,"Entity",null,null,null,"/**Tuple","find:fIndicators","/**Unbounded"]
{"$rows_left_out":107}