{"text_format":"1","workbook":"xlsx","n_sheets":17,"sheets":["Index","S.01.01.02","S.01.02.01","S.02.01.02","S.05.01.02","S.06.02.01","CRT_Filters","data","parameters","S.06.03.01","S.08.01.01","S.08.02.01","S.12.01.02","S.17.01.02","S.23.01.01","S.28.01.01","S.28.02.01"],"not_rendered":{"charts":0,"images":0,"macros":1,"external_links":2,"defined_names":602,"comments":0,"pivot_tables":0},"unopened":[],"bounds":{"document_bytes":16777216,"sheet_cells":100000,"rows_first":2000,"rows_last":500,"rows_between":2000,"halvings":0,"cell_chars":16384,"cell_head_chars":4096},"cells_cut":0,"cells_raw":0,"read":"whole","date_system":"1900"}

{"sheet":"Index","index":0,"n_rows":22,"n_cols":4,"rows_kept":22,"cut":false,"hidden":false,"merged":[[0,0,0,2],[1,0,1,2],[2,0,2,2],[3,0,3,2],[9,1,9,2],[20,1,20,2],[21,1,21,2],[8,1,8,2],[15,1,15,2],[16,1,16,2],[17,1,17,2],[18,1,18,2],[19,1,19,2],[10,1,10,2],[11,1,11,2],[12,1,12,2],[13,1,13,2],[14,1,14,2]]}
["RECEX - Solvency II"]
["RECEX customized for EIOPA Solvency II Tables: S.01.01.02.01, S.01.02.01.01, S.02.01.02.01, S.06.02.01"]
["DPM and Taxonomy 2.2.0 Hotfix (updated 24/11/2017)"]
["Comments to info@recex.eu"]
[]
["Module Name","Quarterly Reporting Solo (qrs)",null,"Arelle location"]
["Version","2.2.0 Hotfix (updated 24/11/2017)",null,"C:\\Program Files\\Arelle"]
[]
{"$rows_left_out":15}
{"sheet":"S.01.01.02","index":1,"n_rows":20,"n_cols":5,"rows_kept":20,"cut":false,"hidden":false,"merged":[]}
["S.01.01.02"]
["Appendix I: Quantitative reporting templates"]
[]
["S.01.01.02.01"]
[]
["Content of the submission"]
[null,null,null,"C0010"]
[null,"Template Code - Template name"]
{"$rows_left_out":13}
{"sheet":"S.01.02.01","index":2,"n_rows":27,"n_cols":6,"rows_kept":27,"cut":false,"hidden":false,"merged":[]}
["S.01.02.01"]
["Basic Information - General"]
[]
["S.01.02.01.01"]
[]
["Basic Information - General"]
[]
[null,null,null,"C0010"]
{"$rows_left_out":20}
{"sheet":"S.02.01.02","index":3,"n_rows":95,"n_cols":11,"rows_kept":95,"cut":false,"hidden":false,"merged":[]}
["S.02.01.02"]
["Balance sheet"]
[]
["S.02.01.02.01"]
[]
["Balance sheet"]
[]
[null,null,"Solvency II value"]
{"$rows_left_out":88}
{"sheet":"S.05.01.02","index":4,"n_rows":74,"n_cols":26,"rows_kept":74,"cut":false,"hidden":false,"merged":[[10,2,10,13],[10,14,10,17],[10,18,11,18],[50,2,50,7],[50,8,50,9],[50,10,51,10]]}
["S.05.01.02"]
["Premiums, claims and expenses by line of business"]
[]
["S.05.01.02.01"]
["Z Axis:"]
["VG/Statutory accounts"]
["DI/Year to Date"]
[]
{"$rows_left_out":67}
{"sheet":"S.06.02.01","index":5,"n_rows":31,"n_cols":20,"rows_kept":31,"cut":false,"hidden":false,"merged":[]}
["S.06.02.01"]
["List of assets"]
[]
["S.06.02.01.01"]
["Z Axis:"]
["SU/Assets other than derivatives and Assets held as collateral"]
[]
["Information on positions held"]
{"$rows_left_out":24}
{"sheet":"CRT_Filters","index":6,"n_rows":997,"n_cols":43,"rows_kept":997,"cut":false,"hidden":true,"merged":[]}
["Total/NA    {s2c_CU:x0}","Bankruptcy of the underlying or reference entity [B]    {s2c_LT:x4}","Life [split applicable]    {s2c_PU:x10}","Total/NA    {s2c_LB:x0}","Micro hedge [MI]    {s2c_PU:x12}","L [closed]    {s2c_MC:x162}","Credit quality step 0    {s2c_BR:x22}","L [open]    {s2c_MC:x163}","Quoted market price in active markets for the same assets or liabilities    {s2c_VM:x43}","Government Bonds    {s2c_MC:x175}","Not applicable/All geographical areas    {s2c_GA:x0}","Local    {s2c_CU:x1}","Total/NA    {s2c_NC:x0}","Not applicable/All geographical areas    {s2c_GA:x0}","Total/NA    {s2c_MC:x0}","Not a participation    {s2c_PU:x16}","Collateral pledged [CP]    {s2c_CG:x4}","Not applicable/All geographical areas    {s2c_GA:x0}","Quoted market price in active markets for the same assets    {s2c_VM:x86}","Undertakings pursuing both life and non-life insurance activity - article 73 (2)    {s2c_SE:x129}","Total/NA    {s2c_LA:x0}","Regular reporting    {s2c_CS:x35}","Total/NA    {s2c_CU:x0}","IFRS    {s2c_AM:x45}","Standard formula    {s2c_AP:x3}","Use of undertaking specific parameters    {s2c_AP:x5}","Reporting activity by RFF    {s2c_PU:x4}","Use of matching adjustment    {s2c_PU:x51}","Use of volatility adjustment    {s2c_AP:x7}","Use of transitional measure on the risk-free interest rate    {s2c_AP:x9}","Use of transitional measure on technical provisions    {s2c_AP:x11}","Initial submission    {s2c_CS:x37}","Reported    {s2c_CN:x1}","Reported    {s2c_CN:x1}","Reported    {s2c_CN:x1}","Reported    {s2c_CN:x1}","Reported    {s2c_CN:x1}","Reported    {s2c_CN:x1}","Reported    {s2c_CN:x1}","Reported    {s2c_CN:x1}","Reported    {s2c_CN:x1}","Reported    {s2c_CN:x1}","Euler Hermes Rating GmbH (LEI code: 391200QXGLWHK9VK6V27)    {s2c_SE:x131}"]
["  EUR    {s2c_CU:EUR}","Adverse fall in value of the underlying reference asset [F]    {s2c_LT:x2}","Non-life [split applicable]    {s2c_PU:x13}","  Unit-linked or index-linked    {s2c_LB:x119}","Macro hedge [MA]    {s2c_PU:x11}","S [closed]    {s2c_MC:x130}","Credit quality step 1    {s2c_BR:x23}","S [open]    {s2c_MC:x131}","Quoted market price in active markets for similar assets or liabilities    {s2c_VM:x42}","Corporate Bonds    {s2c_MC:x176}","  AFGHANISTAN    {s2c_GA:AF}","Foreign    {s2c_CU:x2}","  A - Agriculture, forestry and fishing    {s2c_NC:A}","  AFGHANISTAN    {s2c_GA:AF}","  Not an infrastructure investment    {s2c_MC:x200}","Is a participation    {s2c_PU:x85}","Collateral for reinsurance accepted [CR]    {s2c_CG:x2}","  AFGHANISTAN    {s2c_GA:AF}","Quoted market price in active markets for similar assets    {s2c_VM:x87}","Undertakings pursuing both life and non-life insurance activity - article 73 (5)    {s2c_SE:x130}","  Afar    {s2c_LA:aa}","Ad-hoc reporting    {s2c_CS:x36}","  EUR    {s2c_CU:EUR}","Local GAAP    {s2c_AM:x50}","Partial internal model    {s2c_AP:x2}","Don’t use undertaking specific parameters    {s2c_AP:x6}","Not reporting activity by RFF    {s2c_PU:x17}","No use of matching adjustment    {s2c_PU:x52}","No use of volatility adjustment    {s2c_AP:x8}","No use of transitional measure on the risk-free interest rate    {s2c_AP:x10}","No use of transitional measure on technical provisions    {s2c_AP:x12}","Re-submission    {s2c_CS:x38}",null,"Exempted under Article 35 (6) to (8)    {s2c_CN:x22}","Exempted under Article 35 (6) to (8)    {s2c_CN:x22}","Exempted under Article 35 (6) to (8)    {s2c_CN:x22}","Not reported as no Collective investment undertakings    {s2c_CN:x21}","Not reported o/a no derivative transactions    {s2c_CN:x3}","Not reported o/a no life and health SLT business    {s2c_CN:x4}","Not reported o/a no non-life business    {s2c_CN:x6}","Not reported as both life and non-life insurance or reinsurance activity    {s2c_CN:x61}","Not reported as only life or only non-life insurance or reinsurance activity or only reinsurance activity    {s2c_CN:x62}","Japan Credit Rating Agency Ltd (LEI code: 35380002378CEGMRVW86)    {s2c_SE:x132}"]
["  AED    {s2c_CU:AED}","Adverse change in credit rating of the underlying assets or entity [R]    {s2c_LT:x1}","Ring Fenced Funds    {s2c_PU:x96}","  Neither unit-linked nor index-linked    {s2c_LB:x91}","Matching assets and liabilities cash-flows used in the context of matching adjustment portfolios    {s2c_PU:x58}","FX-FL [closed]    {s2c_MC:x58}","Credit quality step 2    {s2c_BR:x24}","FX-FL [open]    {s2c_MC:x59}","Alternative valuation methods    {s2c_VM:x3}","Listed equity    {s2c_MC:x40}","  ÅLAND ISLANDS    {s2c_GA:AX}",null,"     A1 - Crop and animal production, hunting and related service activities    {s2c_NC:A01}","  ÅLAND ISLANDS    {s2c_GA:AX}","  Government Guarantee    {s2c_MC:x196}",null,"Collateral for securities borrowed [CB]    {s2c_CG:x3}","  ÅLAND ISLANDS    {s2c_GA:AX}","Alternative valuation methods    {s2c_VM:x3}","Life undertakings    {s2c_SE:x95}","  Abkhazian    {s2c_LA:ab}",null,"  AED    {s2c_CU:AED}",null,"Full internal model    {s2c_AP:x1}",null,null,null,null,null,null,null,null,"Not reported other reason    {s2c_CN:x2}","Not reported other reason    {s2c_CN:x2}","Not due as no material changes since quarterly submission    {s2c_CN:x23}","Not due in accordance with instructions of the template    {s2c_CN:x19}","Exempted under Article 35 (6) to (8)    {s2c_CN:x22}","Exempted under Article 35 (6) to (8)    {s2c_CN:x22}","Exempted under Article 35 (6) to (8)    {s2c_CN:x22}","Not reported other reason    {s2c_CN:x2}","Not reported other reason    {s2c_CN:x2}","BCRA-Credit Rating Agency AD (LEI code: 747800Z0IC3P66HTQ142)    {s2c_SE:x133}"]
["  AFN    {s2c_CU:AFN}","Novation [N]    {s2c_LT:x18}","Other internal funds    {s2c_PU:x57}",null,"Efficient portfolio management, other than “Matching assets and liabilities cash-flows used in the context of matching adjustment portfolios”    {s2c_PU:x59}","FX-FX [closed]    {s2c_MC:x60}","Credit quality step 3    {s2c_BR:x25}","FX-FX [open]    {s2c_MC:x61}","Market valuation according to article 9(4) of Delegated Regulation 2015/35    {s2c_VM:x88}","Unlisted equity    {s2c_MC:x41}","  ALBANIA    {s2c_GA:AL}",null,"        A1.1 - Growing of non-perennial crops    {s2c_NC:A011}","  ALBANIA    {s2c_GA:AL}","     Infrastructure non-qualifying: Government Guarantee [Government, Central bank, Regional government or local authority]    {s2c_MC:x253}",null,"Repos [R]    {s2c_CG:x22}","  ALBANIA    {s2c_GA:AL}","Adjusted equity methods - applicable for the valuation of participations [AEM]    {s2c_VM:x2}","Non-Life undertakings    {s2c_SE:x96}","  Avestan    {s2c_LA:ae}",null,"  AFN    {s2c_CU:AFN}",null,null,null,null,null,null,null,null,null,null,null,null,"Not reported other reason    {s2c_CN:x2}","Exempted under Article 35 (6) to (8)    {s2c_CN:x22}","Not due as no material changes since quarterly submission    {s2c_CN:x23}","Not reported other reason    {s2c_CN:x2}","Not reported other reason    {s2c_CN:x2}",null,null,"Creditreform Rating AG (LEI code: 391200PHL11KDUTTST66)    {s2c_SE:x134}"]
["  ALL    {s2c_CU:ALL}","Multiple events or a combination of events [M]    {s2c_LT:x16}","Shareholders' funds    {s2c_PU:x49}",null,null,"FL-FX [closed]    {s2c_MC:x55}","Credit quality step 4    {s2c_BR:x26}","FL-FX [open]    {s2c_MC:x56}",null,"Collective investments undertakings    {s2c_MC:x177}","  ALGERIA    {s2c_GA:DZ}",null,"           A1.1.1 - Growing of cereals (except rice), leguminous crops and oil seeds    {s2c_NC:A0111}","  ALGERIA    {s2c_GA:DZ}","     Infrastructure qualifying: Government Guarantee [Government, Central bank, Regional government or local authority]    {s2c_MC:x254}",null,"Not collateral    {s2c_CG:x15}","  ALGERIA    {s2c_GA:DZ}","IFRS equity methods - applicable for the valuation of participations [IEM]    {s2c_VM:x22}",null,"  Afrikaans    {s2c_LA:af}",null,"  ALL    {s2c_CU:ALL}",null,null,null,null,null,null,null,null,null,null,null,null,null,"Not due as no material changes since quarterly submission    {s2c_CN:x23}","Not reported other reason    {s2c_CN:x2}",null,null,null,null,"Scope Ratings AG (previously PSR Rating GmbH) (LEI code: 391200WU1EZUQFHDWE91)    {s2c_SE:x135}"]
["  AMD    {s2c_CU:AMD}","Other events [O]    {s2c_LT:x19}","General [no split]    {s2c_PU:x3}",null,null,"FL-FL [closed]    {s2c_MC:x53}","Credit quality step 5    {s2c_BR:x27}","FL-FL [open]    {s2c_MC:x54}",null,"Structured notes    {s2c_MC:x136}","  AMERICAN SAMOA    {s2c_GA:AS}",null,"           A1.1.2 - Growing of rice    {s2c_NC:A0112}","  AMERICAN SAMOA    {s2c_GA:AS}","  Government Supported including Public Finance initiative (PFI)    {s2c_MC:x197}",null,null,"  AMERICAN SAMOA    {s2c_GA:AS}","Market valuation according to article 9(4) of Delegated Regulation 2015/35    {s2c_VM:x88}",null,"  Akan    {s2c_LA:ak}",null,"  AMD    {s2c_CU:AMD}",null,null,null,null,null,null,null,null,null,null,null,null,null,"Not reported other reason    {s2c_CN:x2}",null,null,null,null,null,"ICAP Group SA (LEI code: 2138008U6LKT8VG2UK85)    {s2c_SE:x136}"]
["  ANG    {s2c_CU:ANG}","No unwind trigger    {s2c_LT:x25}",null,null,null,null,"Credit quality step 6    {s2c_BR:x28}",null,null,"Collateralised securities    {s2c_MC:x18}","  ANDORRA    {s2c_GA:AD}",null,"           A1.1.3 - Growing of vegetables and melons, roots and tubers    {s2c_NC:A0113}","  ANDORRA    {s2c_GA:AD}","     Infrastructure non-qualifying: Government Supported including Public Finance initiative [Government, Central bank, Regional government or local authority]    {s2c_MC:x255}",null,null,"  ANDORRA    {s2c_GA:AD}",null,null,"  Amharic    {s2c_LA:am}",null,"  ANG    {s2c_CU:ANG}",null,null,null,null,null,null,null,null,null,null,null,null,null,null,null,null,null,null,null,"GBB-Rating Gesellschaft für Bonitätsbeurteilung GmbH (LEI code: 391200OLWXCTKPADVV72)    {s2c_SE:x137}"]
["  AOA    {s2c_CU:AOA}",null,null,null,null,null,"No rating available    {s2c_BR:x29}",null,null,"Cash and deposits    {s2c_MC:x186}","  ANGOLA    {s2c_GA:AO}",null,"           A1.1.4 - Growing of sugar cane    {s2c_NC:A0114}","  ANGOLA    {s2c_GA:AO}","     Infrastructure qualifying: Government Supported including Public Finance initiative [Government, Central bank, Regional government or local authority]    {s2c_MC:x256}",null,null,"  ANGOLA    {s2c_GA:AO}",null,null,"  Aragonese    {s2c_LA:an}",null,"  AOA    {s2c_CU:AOA}",null,null,null,null,null,null,null,null,null,null,null,null,null,null,null,null,null,null,null,"ASSEKURATA Assekuranz Rating-Agentur GmbH (LEI code: 529900977LETWLJF3295)    {s2c_SE:x138}"]
{"$rows_left_out":990}
{"sheet":"data","index":7,"n_rows":171,"n_cols":15,"rows_kept":171,"cut":false,"hidden":true,"merged":[]}
["RowID","Footnote","Primary Item","Decimals","UnitRef","Fact",null,null,null,null,null,"Context"]
[{"$f":"IF(F2=\"\",\"/*\",\"\")","v":"/*"}]
["/*"]
["/*"]
["/*"]
["/*"]
[{"$f":"IF(F7=\"\",\"/*\",\"\")","v":""},null,"find:filingIndicator","","","S.01.01",null,null,null,null,null,"ctxInstant2017","/**Tuple","find:fIndicators","/**Unbounded"]
[{"$f":"IF(F8=\"\",\"/*\",\"\")","v":""},null,"find:filingIndicator","","",{"$f":"IF('S.01.01.02'!D9=\"Reported    {s2c_CN:x1}\",\"S.01.02\",\"\")","v":"S.01.02"},null,null,null,null,null,"ctxInstant2017","/**Tuple","find:fIndicators","/**Unbounded"]
{"$rows_left_out":164}
{"sheet":"parameters","index":8,"n_rows":42,"n_cols":42,"rows_kept":42,"cut":false,"hidden":true,"merged":[[2,30,3,30],[2,41,3,41],[5,30,6,30],[5,41,6,41],[7,30,9,30],[7,41,9,41]]}
["RowID",null,"UnitIni","Unit","UnitEnd",null,"Identifier","IdentifierSchema","PeriodInitDuration","PeriodEndInstant","Dimension","DimensionMember","Dimension","DimensionMember","Dimension","DimensionMember","Dimension","DimensionMember","Dimension","DimensionMember","Dimension","DimensionMember","Dimension","DimensionMember","Dimension","DimensionMember","Dimension","DimensionMember"]
["/* ",null,null,null,null,null,null,null,null,null,null,null,null,null,null,null,null,null,null,null,null,null,null,null,null,null,null,null,null,null,null,null,null,null,null,1,null,"1º TRIM","2º TRIM","3º TRIM","4º TRIM"]
["/**OutputHeader","<?xml version=\"1.0\" encoding=\"UTF-8\"?>\n<?instance-generator id=\"RECEX-SolvencyII\" version=\"2018.04.09\" creationdate=\"2018-04-09T00:00:00+02:00\"?>\n<xbrli:xbrl\n xmlns:s2c_AP=\"http://eiopa.europa.eu/xbrl/s2c/dict/dom/AP\"\n xmlns:s2c_BR=\"http://eiopa.europa.eu/xbrl/s2c/dict/dom/BR\"\n xmlns:s2c_CG=\"http://eiopa.europa.eu/xbrl/s2c/dict/dom/CG\"\n xmlns:s2c_CN=\"http://eiopa.europa.eu/xbrl/s2c/dict/dom/CN\"\n xmlns:s2c_CS=\"http://eiopa.europa.eu/xbrl/s2c/dict/dom/CS\"\n xmlns:s2c_CU=\"http://eiopa.europa.eu/xbrl/s2c/dict/dom/CU\"\n xmlns:s2c_GA=\"http://eiopa.europa.eu/xbrl/s2c/dict/dom/GA\"\n xmlns:s2c_LA=\"http://eiopa.europa.eu/xbrl/s2c/dict/dom/LA\"\n xmlns:s2c_NC=\"http://eiopa.europa.eu/xbrl/s2c/dict/dom/NC\"\n xmlns:s2c_PU=\"http://eiopa.europa.eu/xbrl/s2c/dict/dom/PU\"\n xmlns:s2c_SE=\"http://eiopa.europa.eu/xbrl/s2c/dict/dom/SE\"\n xmlns:find=\"http://www.eurofiling.info/xbrl/ext/filing-indicators\"\n xmlns:iso4217=\"http://www.xbrl.org/2003/iso4217\"\n xmlns:link=\"http://www.xbrl.org/2003/linkbase\"\n xmlns:s2c_AM=\"http://eiopa.europa.eu/xbrl/s2c/dict/dom/AM\"\n xmlns:s2c_LB=\"http://eiopa.europa.eu/xbrl/s2c/dict/dom/LB\"\n xmlns:s2c_MC=\"http://eiopa.europa.eu/xbrl/s2c/dict/dom/MC\"\n xmlns:s2c_VM=\"http://eiopa.europa.eu/xbrl/s2c/dict/dom/VM\"\n xmlns:s2c_dim=\"http://eiopa.europa.eu/xbrl/s2c/dict/dim\"\n xmlns:s2c_typ=\"http://eiopa.europa.eu/xbrl/s2c/dict/typ\"\n xmlns:s2md_met=\"http://eiopa.europa.eu/xbrl/s2md/dict/met\"\n xmlns:xbrldi=\"http://xbrl.org/2006/xbrldi\"\n xmlns:xbrli=\"http://www.xbrl.org/2003/instance\"\n xmlns:xlink=\"http://www.w3.org/1999/xlink\"\n >\n\n<link:schemaRef xlink:href=\"http://eiopa.europa.eu/eu/xbrl/s2md/fws/solvency/solvency2/2017-07-15/mod/qrs.xsd\" xlink:type=\"simple\"/>\n",null,null,null,null,null,null,null,null,null,null,null,null,null,null,null,null,null,null,null,null,null,null,null,null,null,null,null,null,null,null,null,null,null,2,"Inicio trimestre actual",{"$f":"+#REF!&\"-\"&\"12-31\"","v":{"$error":"#REF!"}},{"$f":"+AL4","v":{"$error":"#REF!"}},{"$f":"+AM4","v":{"$error":"#REF!"}},{"$f":"+AN4","v":{"$error":"#REF!"}},"anual"]
["/**OutputMiddle",{"$f":"CONCATENATE(C4,D4,E4)","v":"<xbrli:unit id=\"uEUR\">\n<xbrli:measure>iso4217:EUR</xbrli:measure>\n</xbrli:unit>"},"<xbrli:unit id=\"uEUR\">\n<xbrli:measure>iso4217:","EUR","</xbrli:measure>\n</xbrli:unit>",null,null,null,null,null,null,null,null,null,null,null,null,null,null,null,null,null,null,null,null,null,null,null,null,null,null,null,null,null,null,3,"fin trimestre actual",{"$f":"+#REF!&\"-\"&\"03-31\"","v":{"$error":"#REF!"}},{"$f":"+#REF!&\"-\"&\"06-30\"","v":{"$error":"#REF!"}},{"$f":"+#REF!&\"-\"&\"09-30\"","v":{"$error":"#REF!"}},{"$f":"+#REF!&\"-\"&\"12-31\"","v":{"$error":"#REF!"}}]
["/**OutputMiddle",{"$f":"CONCATENATE(C5,D5,E5)","v":"<xbrli:unit id=\"uPure\">\n<xbrli:measure>xbrli:pure</xbrli:measure>\n</xbrli:unit>"},"<xbrli:unit id=\"uPure\">\n<xbrli:measure>","xbrli:pure","</xbrli:measure>\n</xbrli:unit>",null,null,null,null,null,null,null,null,null,null,null,null,null,null,null,null,null,null,null,null,null,null,null,null,null,null,null,null,null,null,3,"fin trimestre actual",{"$f":"+#REF!&\"-\"&\"03-31\"","v":{"$error":"#REF!"}},{"$f":"+#REF!&\"-\"&\"06-30\"","v":{"$error":"#REF!"}},{"$f":"+#REF!&\"-\"&\"09-30\"","v":{"$error":"#REF!"}},{"$f":"+#REF!&\"-\"&\"12-31\"","v":{"$error":"#REF!"}}]
["/**OutputTail","</xbrli:xbrl>",null,null,null,null,null,null,null,null,null,null,null,null,null,null,null,null,null,null,null,null,null,null,null,null,null,null,null,null,null,null,null,null,null,10,"fin acumulado comparativo semestral",{"$f":"+#REF!&\"-12-31\"","v":{"$error":"#REF!"}},{"$f":"+#REF!&\"-12-31\"","v":{"$error":"#REF!"}},{"$f":"+#REF!&\"-\"&\"06-30\"","v":{"$error":"#REF!"}},{"$f":"+#REF!&\"-\"&\"06-30\"","v":{"$error":"#REF!"}}]
["/* ",null,null,null,null,null,null,null,null,null,null,null,null,null,null,null,null,null,null,null,null,null,null,null,null,null,null,null,null,null,null,null,null,null,null,11,"inicio acumulado actual semestral",{"$f":"+AL6","v":{"$error":"#REF!"}},{"$f":"+AM6","v":{"$error":"#REF!"}},{"$f":"+#REF!&\"-\"&\"06-30\"","v":{"$error":"#REF!"}},{"$f":"+#REF!&\"-\"&\"06-30\"","v":{"$error":"#REF!"}}]
["/* ","Contexts",null,null,null,null,null,null,null,null,null,null,null,null,null,null,null,null,null,null,null,null,null,null,null,null,null,null,null,null,null,null,null,null,null,12,"Inicio trimestre actual",{"$f":"+#REF!&\"-01-01\"","v":{"$error":"#REF!"}},{"$f":"+#REF!&\"-04-01\"","v":{"$error":"#REF!"}},{"$f":"+#REF!&\"-07-01\"","v":{"$error":"#REF!"}},{"$f":"+#REF!&\"-10-01\"","v":{"$error":"#REF!"}},"anual"]
{"$rows_left_out":35}
{"sheet":"S.06.03.01","index":9,"n_rows":17,"n_cols":6,"rows_kept":17,"cut":false,"hidden":false,"merged":[]}
["S.06.03.01"]
["Collective investment undertakings - look-through approach"]
[]
["S.06.03.01.01"]
["Z Axis:"]
["SU/Assets other than derivatives and Assets held as collateral"]
[]
["Collective investment undertakings - look-through approach"]
{"$rows_left_out":10}
{"sheet":"S.08.01.01","index":10,"n_rows":29,"n_cols":21,"rows_kept":29,"cut":false,"hidden":false,"merged":[]}
["S.08.01.01"]
["Open derivatives"]
[]
["S.08.01.01.01"]
["Z Axis:"]
["SU/Derivatives - Open"]
[]
["Information on positions held"]
{"$rows_left_out":22}
{"sheet":"S.08.02.01","index":11,"n_rows":29,"n_cols":19,"rows_kept":29,"cut":false,"hidden":false,"merged":[]}
["S.08.02.01"]
["Derivatives Transactions"]
[]
["S.08.02.01.01"]
["Z Axis:"]
["SU/Derivatives - Transactions"]
[]
["Information on positions held"]
{"$rows_left_out":22}
{"sheet":"S.12.01.02","index":12,"n_rows":26,"n_cols":28,"rows_kept":26,"cut":false,"hidden":false,"merged":[[7,12,7,14],[7,15,8,15],[7,16,8,16],[7,17,8,17],[7,2,8,2],[7,3,7,5],[7,6,7,8],[7,9,8,9],[7,10,8,10],[7,11,8,11]]}
["S.12.01.02"]
["Life and Health SLT Technical Provisions"]
[]
["S.12.01.02.01"]
[]
["Life and Health SLT Technical Provisions"]
[]
[null,null,"Insurance with profit participation","Index-linked and unit-linked insurance",null,null,"Other life insurance",null,null,"Annuities stemming from non-life insurance contracts and relating to insurance obligation other than health insurance obligations","Accepted reinsurance","Total (Life other than health insurance, incl. Unit-Linked)","Health insurance (direct business)",null,null,"Annuities stemming from non-life insurance contracts and relating to health insurance obligations","Health reinsurance (reinsurance accepted)","Total (Health similar to life insurance)"]
{"$rows_left_out":19}
{"sheet":"S.17.01.02","index":13,"n_rows":34,"n_cols":27,"rows_kept":34,"cut":false,"hidden":false,"merged":[[7,2,7,13],[7,14,7,17],[7,18,8,18]]}
["S.17.01.02"]
["Non-Life Technical Provisions"]
[]
["S.17.01.02.01"]
[]
["Non-Life Technical Provisions"]
[]
[null,null,"Direct business and accepted proportional reinsurance",null,null,null,null,null,null,null,null,null,null,null,"Accepted non-proportional reinsurance",null,null,null,"Total Non-Life obligation"]
{"$rows_left_out":27}
{"sheet":"S.23.01.01","index":14,"n_rows":69,"n_cols":13,"rows_kept":69,"cut":false,"hidden":false,"merged":[]}
["S.23.01.01"]
["Own funds"]
[]
["S.23.01.01.01"]
["Z Axis:"]
["VG/Solvency II"]
[]
["Own funds"]
{"$rows_left_out":62}
{"sheet":"S.28.01.01","index":15,"n_rows":83,"n_cols":10,"rows_kept":83,"cut":false,"hidden":false,"merged":[[17,2,17,3]]}
["S.28.01.01"]
["Minimum Capital Requirement - Only life or only non-life insurance or reinsurance activity"]
[]
["S.28.01.01.01"]
[]
["Linear formula component for non-life insurance and reinsurance obligations"]
[]
[null,null,"MCR components"]
{"$rows_left_out":76}
{"sheet":"S.28.02.01","index":16,"n_rows":113,"n_cols":10,"rows_kept":113,"cut":false,"hidden":false,"merged":[[7,2,7,3],[20,2,20,5],[21,2,21,3],[21,4,21,5],[66,2,66,3],[66,4,66,5]]}
["S.28.02.01"]
["Minimum Capital Requirement - Both life and non-life insurance activity"]
[]
["S.28.02.01.01"]
[]
["MCR components"]
[]
[null,null,"MCR components"]
{"$rows_left_out":105}